Building src
make[1]: Entering directory `/home/ruya/Unreal3.2/src'
gcc -I../include -I/home/ruya/Unreal3.2/extras/regexp/include -pipe -g -O2 -funsigned-char -export-dynamic -c s_bsd.c
s_bsd.c:1432:44: missing terminating " character
s_bsd.c: In function `read_packet':
s_bsd.c:1433: error: syntax error before "Flood"
s_bsd.c:1433:7: missing terminating " character
make[1]: *** [s_bsd.o] Error 1
make[1]: Leaving directory `/home/ruya/Unreal3.2/src'
make: *** [build] Error 2 |